Skip to content

Disable the other new Messaging test on Desktop #16071

Disable the other new Messaging test on Desktop

Disable the other new Messaging test on Desktop #16071

Triggered via pull request August 12, 2026 16:53
Status Failure
Total duration 5h 8m 33s
Artifacts 18

integration_tests.yml

on: pull_request
check_and_prepare
25s
check_and_prepare
Matrix: build_android
Matrix: build_desktop
Matrix: build_ios
Matrix: build_tvos
Matrix: test_android
Matrix: test_desktop
Matrix: test_ios
Matrix: test_tvos
summarize-results
20s
summarize-results
attempt-retry
0s
attempt-retry
Fit to window
Zoom out
Zoom in

Annotations

14 errors and 24 warnings
build-android-windows-2022
Process completed with exit code 1.
build-android-windows-2022
Process completed with exit code 1.
build-android-macos-15
Process completed with exit code 1.
build-android-macos-15
Process completed with exit code 1.
test-android-ubuntu-22.04-android_target-gameloop
Process completed with exit code 1.
test-android-ubuntu-22.04-android_target-gameloop
Process completed with exit code 1.
test-android-ubuntu-22.04-android_target-gameloop
The action has timed out.
test-android-macos-15-android_target-gameloop
Process completed with exit code 1.
test-android-macos-15-android_target-gameloop
Process completed with exit code 1.
test-android-macos-15-android_target-gameloop
The action has timed out.
test-android-windows-2022-android_target-gameloop
Process completed with exit code 1.
test-android-windows-2022-android_target-gameloop
Process completed with exit code 1.
test-android-windows-2022-android_target-gameloop
The action has timed out.
summarize-results
INTEGRATION TEST FAILURES ————————————————————————— firestore: Errors and Failures (1): - [BUILD] [ERROR] [Android] [1/3 os: windows] remote_config: Errors and Failures (1): - [BUILD] [ERROR] [Android] [1/3 os: macos] missing_log: Errors and Failures (1): - [TEST] [ERROR] [Android] [All 3 os] [1/2 android_device: android_target]
check_and_prepare
Node.js 20 is deprecated. The following actions target Node.js 20 but are being forced to run on Node.js 24: actions/checkout@f43a0e5ff2bd294095638e18286ca9a3d1956744, actions/setup-python@7f4fc3e22c37d6ff65e88745f38bd3157c663f7c, lannonbr/repo-permission-check-action@b23b656f0dfb810f0c5e224a264d621a92a6f271, nick-invision/retry@14672906e672a08bd6eeb15720e9ed3ce869cdd4. For more information see: https://github.blog/changelog/2025-09-19-deprecation-of-node-20-on-github-actions-runners/
check_and_prepare
Running pull request tests
build-desktop-ubuntu-22.04-x64-openssl
Node.js 20 is deprecated. The following actions target Node.js 20 but are being forced to run on Node.js 24: actions/cache@6f8efc29b200d32929f49075959781ed54ec270c, actions/checkout@f43a0e5ff2bd294095638e18286ca9a3d1956744, actions/setup-python@7f4fc3e22c37d6ff65e88745f38bd3157c663f7c, actions/upload-artifact@ea165f8d65b6e75b540449e92b4886f43607fa02, nick-invision/retry@14672906e672a08bd6eeb15720e9ed3ce869cdd4. For more information see: https://github.blog/changelog/2025-09-19-deprecation-of-node-20-on-github-actions-runners/
build-desktop-ubuntu-22.04-x64-openssl
No files were found with the provided path: D:/a/firebase-cpp-sdk/firebase-cpp-sdk/ta/firestore/iti/CMakeFiles/. No artifacts will be uploaded.
build-tvos-macos-15
Node.js 20 is deprecated. The following actions target Node.js 20 but are being forced to run on Node.js 24: actions/checkout@f43a0e5ff2bd294095638e18286ca9a3d1956744, actions/setup-python@7f4fc3e22c37d6ff65e88745f38bd3157c663f7c, actions/upload-artifact@ea165f8d65b6e75b540449e92b4886f43607fa02, nick-invision/retry@14672906e672a08bd6eeb15720e9ed3ce869cdd4. For more information see: https://github.blog/changelog/2025-09-19-deprecation-of-node-20-on-github-actions-runners/
build-android-windows-2022
Node.js 20 is deprecated. The following actions target Node.js 20 but are being forced to run on Node.js 24: actions/cache@6f8efc29b200d32929f49075959781ed54ec270c, actions/checkout@f43a0e5ff2bd294095638e18286ca9a3d1956744, actions/download-artifact@d3f86a106a0bac45b974a628896c90dbdf5c8093, actions/setup-python@7f4fc3e22c37d6ff65e88745f38bd3157c663f7c, actions/upload-artifact@ea165f8d65b6e75b540449e92b4886f43607fa02, microsoft/setup-msbuild@34cfbaee7f672c76950673338facd8a73f637506, nick-invision/retry@14672906e672a08bd6eeb15720e9ed3ce869cdd4. For more information see: https://github.blog/changelog/2025-09-19-deprecation-of-node-20-on-github-actions-runners/
build-android-macos-15
Node.js 20 is deprecated. The following actions target Node.js 20 but are being forced to run on Node.js 24: actions/cache@6f8efc29b200d32929f49075959781ed54ec270c, actions/checkout@f43a0e5ff2bd294095638e18286ca9a3d1956744, actions/download-artifact@d3f86a106a0bac45b974a628896c90dbdf5c8093, actions/setup-python@7f4fc3e22c37d6ff65e88745f38bd3157c663f7c, actions/upload-artifact@ea165f8d65b6e75b540449e92b4886f43607fa02, nick-invision/retry@14672906e672a08bd6eeb15720e9ed3ce869cdd4. For more information see: https://github.blog/changelog/2025-09-19-deprecation-of-node-20-on-github-actions-runners/
build-android-ubuntu-22.04
Node.js 20 is deprecated. The following actions target Node.js 20 but are being forced to run on Node.js 24: actions/cache@6f8efc29b200d32929f49075959781ed54ec270c, actions/checkout@f43a0e5ff2bd294095638e18286ca9a3d1956744, actions/setup-python@7f4fc3e22c37d6ff65e88745f38bd3157c663f7c, actions/upload-artifact@ea165f8d65b6e75b540449e92b4886f43607fa02, nick-invision/retry@14672906e672a08bd6eeb15720e9ed3ce869cdd4. For more information see: https://github.blog/changelog/2025-09-19-deprecation-of-node-20-on-github-actions-runners/
test-android-windows-2022-emulator_ftl_target-gameloop
Node.js 20 is deprecated. The following actions target Node.js 20 but are being forced to run on Node.js 24: actions/checkout@f43a0e5ff2bd294095638e18286ca9a3d1956744, actions/download-artifact@d3f86a106a0bac45b974a628896c90dbdf5c8093, actions/setup-java@17f84c3641ba7b8f6deff6309fc4c864478f5d62, actions/setup-python@7f4fc3e22c37d6ff65e88745f38bd3157c663f7c, actions/upload-artifact@ea165f8d65b6e75b540449e92b4886f43607fa02, google-github-actions/auth@v2, google-github-actions/setup-gcloud@v1, nick-invision/retry@14672906e672a08bd6eeb15720e9ed3ce869cdd4. For more information see: https://github.blog/changelog/2025-09-19-deprecation-of-node-20-on-github-actions-runners/
test-tvos-macos-15-tvos_simulator
Node.js 20 is deprecated. The following actions target Node.js 20 but are being forced to run on Node.js 24: actions/checkout@f43a0e5ff2bd294095638e18286ca9a3d1956744, actions/download-artifact@d3f86a106a0bac45b974a628896c90dbdf5c8093, actions/setup-java@c1e323688fd81a25caa38c78aa6df2d33d3e20d9, actions/setup-python@7f4fc3e22c37d6ff65e88745f38bd3157c663f7c, actions/upload-artifact@ea165f8d65b6e75b540449e92b4886f43607fa02, nick-invision/retry@14672906e672a08bd6eeb15720e9ed3ce869cdd4. For more information see: https://github.blog/changelog/2025-09-19-deprecation-of-node-20-on-github-actions-runners/
test-tvos-macos-15-tvos_simulator
No files were found with the provided path: testapps/video-*-tvos-macos-15-tvos_simulator.mp4. No artifacts will be uploaded.
test-android-ubuntu-22.04-emulator_ftl_target-gameloop
Node.js 20 is deprecated. The following actions target Node.js 20 but are being forced to run on Node.js 24: actions/checkout@f43a0e5ff2bd294095638e18286ca9a3d1956744, actions/download-artifact@d3f86a106a0bac45b974a628896c90dbdf5c8093, actions/setup-java@17f84c3641ba7b8f6deff6309fc4c864478f5d62, actions/setup-python@7f4fc3e22c37d6ff65e88745f38bd3157c663f7c, actions/upload-artifact@ea165f8d65b6e75b540449e92b4886f43607fa02, google-github-actions/auth@v2, google-github-actions/setup-gcloud@v1, nick-invision/retry@14672906e672a08bd6eeb15720e9ed3ce869cdd4. For more information see: https://github.blog/changelog/2025-09-19-deprecation-of-node-20-on-github-actions-runners/
test-android-macos-15-emulator_ftl_target-gameloop
Node.js 20 is deprecated. The following actions target Node.js 20 but are being forced to run on Node.js 24: actions/checkout@f43a0e5ff2bd294095638e18286ca9a3d1956744, actions/download-artifact@d3f86a106a0bac45b974a628896c90dbdf5c8093, actions/setup-java@17f84c3641ba7b8f6deff6309fc4c864478f5d62, actions/setup-python@7f4fc3e22c37d6ff65e88745f38bd3157c663f7c, actions/upload-artifact@ea165f8d65b6e75b540449e92b4886f43607fa02, google-github-actions/auth@v2, google-github-actions/setup-gcloud@v1, nick-invision/retry@14672906e672a08bd6eeb15720e9ed3ce869cdd4. For more information see: https://github.blog/changelog/2025-09-19-deprecation-of-node-20-on-github-actions-runners/
build-ios-macos-15
Node.js 20 is deprecated. The following actions target Node.js 20 but are being forced to run on Node.js 24: actions/checkout@f43a0e5ff2bd294095638e18286ca9a3d1956744, actions/setup-python@7f4fc3e22c37d6ff65e88745f38bd3157c663f7c, actions/upload-artifact@ea165f8d65b6e75b540449e92b4886f43607fa02, nick-invision/retry@14672906e672a08bd6eeb15720e9ed3ce869cdd4. For more information see: https://github.blog/changelog/2025-09-19-deprecation-of-node-20-on-github-actions-runners/
test-ios-macos-15-ios_target-gameloop
Node.js 20 is deprecated. The following actions target Node.js 20 but are being forced to run on Node.js 24: actions/checkout@f43a0e5ff2bd294095638e18286ca9a3d1956744, actions/download-artifact@d3f86a106a0bac45b974a628896c90dbdf5c8093, actions/setup-java@17f84c3641ba7b8f6deff6309fc4c864478f5d62, actions/setup-node@3235b876344d2a9aa001b8d1453c930bba69e610, actions/setup-python@7f4fc3e22c37d6ff65e88745f38bd3157c663f7c, actions/upload-artifact@ea165f8d65b6e75b540449e92b4886f43607fa02, google-github-actions/auth@v2, google-github-actions/setup-gcloud@v1, nick-invision/retry@14672906e672a08bd6eeb15720e9ed3ce869cdd4. For more information see: https://github.blog/changelog/2025-09-19-deprecation-of-node-20-on-github-actions-runners/
build-desktop-windows-2022-x64-openssl
Node.js 20 is deprecated. The following actions target Node.js 20 but are being forced to run on Node.js 24: actions/cache@6f8efc29b200d32929f49075959781ed54ec270c, actions/checkout@f43a0e5ff2bd294095638e18286ca9a3d1956744, actions/setup-python@7f4fc3e22c37d6ff65e88745f38bd3157c663f7c, actions/upload-artifact@ea165f8d65b6e75b540449e92b4886f43607fa02, microsoft/setup-msbuild@34cfbaee7f672c76950673338facd8a73f637506, nick-invision/retry@14672906e672a08bd6eeb15720e9ed3ce869cdd4. For more information see: https://github.blog/changelog/2025-09-19-deprecation-of-node-20-on-github-actions-runners/
test-desktop-ubuntu-22.04-x64-openssl
Node.js 20 is deprecated. The following actions target Node.js 20 but are being forced to run on Node.js 24: actions/checkout@f43a0e5ff2bd294095638e18286ca9a3d1956744, actions/download-artifact@d3f86a106a0bac45b974a628896c90dbdf5c8093, actions/setup-java@17f84c3641ba7b8f6deff6309fc4c864478f5d62, actions/setup-node@3235b876344d2a9aa001b8d1453c930bba69e610, actions/setup-python@7f4fc3e22c37d6ff65e88745f38bd3157c663f7c, actions/upload-artifact@ea165f8d65b6e75b540449e92b4886f43607fa02, nick-invision/retry@14672906e672a08bd6eeb15720e9ed3ce869cdd4. For more information see: https://github.blog/changelog/2025-09-19-deprecation-of-node-20-on-github-actions-runners/
test-desktop-windows-2022-x64-openssl
Node.js 20 is deprecated. The following actions target Node.js 20 but are being forced to run on Node.js 24: actions/checkout@f43a0e5ff2bd294095638e18286ca9a3d1956744, actions/download-artifact@d3f86a106a0bac45b974a628896c90dbdf5c8093, actions/setup-java@17f84c3641ba7b8f6deff6309fc4c864478f5d62, actions/setup-node@3235b876344d2a9aa001b8d1453c930bba69e610, actions/setup-python@7f4fc3e22c37d6ff65e88745f38bd3157c663f7c, actions/upload-artifact@ea165f8d65b6e75b540449e92b4886f43607fa02, nick-invision/retry@14672906e672a08bd6eeb15720e9ed3ce869cdd4. For more information see: https://github.blog/changelog/2025-09-19-deprecation-of-node-20-on-github-actions-runners/
test-ios-macos-15-simulator_target-gameloop
Node.js 20 is deprecated. The following actions target Node.js 20 but are being forced to run on Node.js 24: actions/checkout@f43a0e5ff2bd294095638e18286ca9a3d1956744, actions/download-artifact@d3f86a106a0bac45b974a628896c90dbdf5c8093, actions/setup-java@17f84c3641ba7b8f6deff6309fc4c864478f5d62, actions/setup-node@3235b876344d2a9aa001b8d1453c930bba69e610, actions/setup-python@7f4fc3e22c37d6ff65e88745f38bd3157c663f7c, actions/upload-artifact@ea165f8d65b6e75b540449e92b4886f43607fa02, nick-invision/retry@14672906e672a08bd6eeb15720e9ed3ce869cdd4. For more information see: https://github.blog/changelog/2025-09-19-deprecation-of-node-20-on-github-actions-runners/
test-ios-macos-15-simulator_target-gameloop
No files were found with the provided path: testapps/video-*-ios-macos-15-simulator_target-gameloop.mp4. No artifacts will be uploaded.
test-android-ubuntu-22.04-android_target-gameloop
Node.js 20 is deprecated. The following actions target Node.js 20 but are being forced to run on Node.js 24: actions/checkout@f43a0e5ff2bd294095638e18286ca9a3d1956744, actions/download-artifact@d3f86a106a0bac45b974a628896c90dbdf5c8093, actions/setup-java@17f84c3641ba7b8f6deff6309fc4c864478f5d62, actions/setup-python@7f4fc3e22c37d6ff65e88745f38bd3157c663f7c, actions/upload-artifact@ea165f8d65b6e75b540449e92b4886f43607fa02, google-github-actions/auth@v2, google-github-actions/setup-gcloud@v1, nick-invision/retry@14672906e672a08bd6eeb15720e9ed3ce869cdd4. For more information see: https://github.blog/changelog/2025-09-19-deprecation-of-node-20-on-github-actions-runners/
test-android-macos-15-android_target-gameloop
Node.js 20 is deprecated. The following actions target Node.js 20 but are being forced to run on Node.js 24: actions/checkout@f43a0e5ff2bd294095638e18286ca9a3d1956744, actions/download-artifact@d3f86a106a0bac45b974a628896c90dbdf5c8093, actions/setup-java@17f84c3641ba7b8f6deff6309fc4c864478f5d62, actions/setup-python@7f4fc3e22c37d6ff65e88745f38bd3157c663f7c, actions/upload-artifact@ea165f8d65b6e75b540449e92b4886f43607fa02, google-github-actions/auth@v2, google-github-actions/setup-gcloud@v1, nick-invision/retry@14672906e672a08bd6eeb15720e9ed3ce869cdd4. For more information see: https://github.blog/changelog/2025-09-19-deprecation-of-node-20-on-github-actions-runners/
test-android-windows-2022-android_target-gameloop
Node.js 20 is deprecated. The following actions target Node.js 20 but are being forced to run on Node.js 24: actions/checkout@f43a0e5ff2bd294095638e18286ca9a3d1956744, actions/download-artifact@d3f86a106a0bac45b974a628896c90dbdf5c8093, actions/setup-java@17f84c3641ba7b8f6deff6309fc4c864478f5d62, actions/setup-python@7f4fc3e22c37d6ff65e88745f38bd3157c663f7c, actions/upload-artifact@ea165f8d65b6e75b540449e92b4886f43607fa02, google-github-actions/auth@v2, google-github-actions/setup-gcloud@v1, nick-invision/retry@14672906e672a08bd6eeb15720e9ed3ce869cdd4. For more information see: https://github.blog/changelog/2025-09-19-deprecation-of-node-20-on-github-actions-runners/
summarize-results
Node.js 20 is deprecated. The following actions target Node.js 20 but are being forced to run on Node.js 24: actions/checkout@f43a0e5ff2bd294095638e18286ca9a3d1956744, actions/download-artifact@d3f86a106a0bac45b974a628896c90dbdf5c8093, actions/setup-python@7f4fc3e22c37d6ff65e88745f38bd3157c663f7c. For more information see: https://github.blog/changelog/2025-09-19-deprecation-of-node-20-on-github-actions-runners/

Artifacts

Produced during runtime
Name Size Digest
log-artifact-build-android-macos-15
803 Bytes
sha256:24eaa639be07ec9de051fd19db6c187692da37b94948e0997d6cd806251e7c50
log-artifact-build-android-ubuntu-22.04
669 Bytes
sha256:b6832db92aa3956ad152dfecd67f86db6a0fe427e3e06d74b0ed2689668e5346
log-artifact-build-android-windows-2022
830 Bytes
sha256:126b73f8ae8a2fec16b8b6b4ec07126329cec5427f04af525340ddc5774d9ed9
log-artifact-build-ios-macos-15
634 Bytes
sha256:8e9b2c4e0e6aa72a56d10b1ef0c0aaac2fac9a0e77456885c77ecac932f4840f
log-artifact-build-tvos-macos-15
639 Bytes
sha256:65cab687ed03c3b8fb12f127b759c0ba7273dc27cbcb2911a6a08e88f554ed8f
log-artifact-build-ubuntu-22.04-x64-openssl
718 Bytes
sha256:cc648b9cb89a0a4c4f99964389e6da542ccbf2dea27c4eda033725a834399078
log-artifact-build-windows-2022-x64-openssl
725 Bytes
sha256:9ede62c92679db44266cee7527b2f3403b392d3b3ef62bb45ed3b296c99be3d8
log-artifact-test-android-macos-15-android_target-gameloop
260 Bytes
sha256:235d32c68f45834952621cd086d05bc623a3b1c871903418e0fd4fec2c58d161
log-artifact-test-android-macos-15-emulator_ftl_target-gameloop
838 Bytes
sha256:8225eda22aefeb2981cc59993720a4fdde4afcb5a2373fdb6475739c64cf8959
log-artifact-test-android-ubuntu-22.04-android_target-gameloop
268 Bytes
sha256:f6f730ca6497dc751a130b182b3782e8bf4daf5c67a4ae76fbbd6b8c7bd3830b
log-artifact-test-android-ubuntu-22.04-emulator_ftl_target-gameloop
880 Bytes
sha256:92a2efa21ce13950d2e6f8acd5910d49337771a444bc74d84a21af4a555f1e38
log-artifact-test-android-windows-2022-android_target-gameloop
268 Bytes
sha256:e5d74b7f8acfd8c8eec5c9d95fa69025ed1f057e02af227f53eb6df882fc982e
log-artifact-test-android-windows-2022-emulator_ftl_target-gameloop
863 Bytes
sha256:90d5039a10c8d10bfd4706ebf83f14b02e53dd29c1fc10497ff5400df793844f
log-artifact-test-ios-macos-15-ios_target-gameloop
808 Bytes
sha256:b2c7cad3418d2ec35ae7b6dc8774d21cbe84e1531fbeef3817728f623419d66c
log-artifact-test-ios-macos-15-simulator_target-gameloop
845 Bytes
sha256:777df3c41de2ee81e5e54ca01ee683ea8577c89ece543057ea3946db841b08d6
log-artifact-test-tvos-macos-15-tvos_simulator
795 Bytes
sha256:7ad2c2effac29b55d7f46efcb1af7b1907c46dfb9526e74def23996b735107a8
log-artifact-test-ubuntu-22.04-x64-openssl
818 Bytes
sha256:f10664abcd3b87afbf7d6de127ab90ecec0ea4bae744a1bbb5cc825dbdad4c40
log-artifact-test-windows-2022-x64-openssl
816 Bytes
sha256:81bd3060d3e9c6f62ccadbbf0cc9fed1d935f4060707889377d6295a7616430c